Reaction Details
TargetD(3) dopamine receptor
LigandBDBM50218405
Substrate/Competitorn/a
Meas. Tech.ChEMBL_62585 (CHEMBL673113)
Ki 13±n/a nM
Citation Austin, NEAvenell, KYBoyfield, IBranch, CLHadley, MSJeffrey, PJohnson, CNMacdonald, GJNash, DJRiley, GJSmith, ABStemp, GThewlis, KMVong, AKWood, M Novel 2,3,4,5-tetrahydro-1H-3-benzazepines with high affinity and selectivity for the dopamine D3 receptor. Bioorg Med Chem Lett10:2553-5 (2000) D(3) dopamine receptor
Name:D(3) dopamine receptor
Type:n/a
Mol. Mass.:44243.43
Organism:Homo sapiens (Human)
Description:n/a
Residue:400
BDBM50218405
NameBDBM50218405
Synonyms:CHEMBL86127
TypeSmall organic molecule
Emp. Form.C29H32N4O
Mol. Mass.452.5906
SMILESO=C(N[C@H]1CC[C@H](CCN2CCc3ccc(cc3CC2)C#N)CC1)c1cccc2ncccc12