Reaction Details
TargetD(3) dopamine receptor
LigandBDBM50218412
Substrate/Competitorn/a
Meas. Tech.ChEMBL_62585 (CHEMBL673113)
Ki 4.0±n/a nM
Citation Austin, NEAvenell, KYBoyfield, IBranch, CLHadley, MSJeffrey, PJohnson, CNMacdonald, GJNash, DJRiley, GJSmith, ABStemp, GThewlis, KMVong, AKWood, M Novel 2,3,4,5-tetrahydro-1H-3-benzazepines with high affinity and selectivity for the dopamine D3 receptor. Bioorg Med Chem Lett10:2553-5 (2000) D(3) dopamine receptor
Name:D(3) dopamine receptor
Type:n/a
Mol. Mass.:44243.43
Organism:Homo sapiens (Human)
Description:n/a
Residue:400
BDBM50218412
NameBDBM50218412
Synonyms:CHEMBL419487
TypeSmall organic molecule
Emp. Form.C30H35N3O2
Mol. Mass.469.6178
SMILESCC(=O)c1cccc(\C=C\C(=O)N[C@H]2CC[C@H](CCN3CCc4ccc(cc4CC3)C#N)CC2)c1