Reaction Details
TargetD(3) dopamine receptor
LigandBDBM50218413
Substrate/Competitorn/a
Meas. Tech.ChEMBL_62585 (CHEMBL673113)
Ki 10.0±n/a nM
Citation Austin, NEAvenell, KYBoyfield, IBranch, CLHadley, MSJeffrey, PJohnson, CNMacdonald, GJNash, DJRiley, GJSmith, ABStemp, GThewlis, KMVong, AKWood, M Novel 2,3,4,5-tetrahydro-1H-3-benzazepines with high affinity and selectivity for the dopamine D3 receptor. Bioorg Med Chem Lett10:2553-5 (2000) D(3) dopamine receptor
Name:D(3) dopamine receptor
Type:n/a
Mol. Mass.:44243.43
Organism:Homo sapiens (Human)
Description:n/a
Residue:400
BDBM50218413
NameBDBM50218413
Synonyms:CHEMBL87753
TypeSmall organic molecule
Emp. Form.C29H32N4O2
Mol. Mass.468.59
SMILESOc1ccc2ccc(cc2n1)C(=O)N[C@H]1CC[C@H](CCN2CCc3ccc(cc3CC2)C#N)CC1