Reaction Details
TargetD(3) dopamine receptor
LigandBDBM50218408
Substrate/Competitorn/a
Meas. Tech.ChEMBL_62585 (CHEMBL673113)
Ki 10.0±n/a nM
Citation Austin, NEAvenell, KYBoyfield, IBranch, CLHadley, MSJeffrey, PJohnson, CNMacdonald, GJNash, DJRiley, GJSmith, ABStemp, GThewlis, KMVong, AKWood, M Novel 2,3,4,5-tetrahydro-1H-3-benzazepines with high affinity and selectivity for the dopamine D3 receptor. Bioorg Med Chem Lett10:2553-5 (2000) D(3) dopamine receptor
Name:D(3) dopamine receptor
Type:n/a
Mol. Mass.:44243.43
Organism:Homo sapiens (Human)
Description:n/a
Residue:400
BDBM50218408
NameBDBM50218408
Synonyms:CHEMBL315209
TypeSmall organic molecule
Emp. Form.C28H32FN3O
Mol. Mass.445.5716
SMILESFc1ccccc1\C=C\C(=O)N[C@H]1CC[C@H](CCN2CCc3ccc(cc3CC2)C#N)CC1