Reaction Details
TargetThioredoxin reductase 3
LigandBDBM50218842
Substrate/Competitorn/a
Meas. Tech.ChEMBL_210563 (CHEMBL816515)
IC50 4800±n/a nM
Citation Wipf, PHopkins, TDJung, JKRodriguez, SBirmingham, ASouthwick, ECLazo, JSPowis, G New inhibitors of the thioredoxin-thioredoxin reductase system based on a naphthoquinone spiroketal natural product lead. Bioorg Med Chem Lett11:2637-41 (2001) Thioredoxin reductase 3
Name:Thioredoxin reductase 3
Type:PROTEIN
Mol. Mass.:70543.23
Organism:Homo sapiens (Human)
Description:ChEMBL_104858
Residue:642
BDBM50218842
NameBDBM50218842
Synonyms:CHEMBL419314
TypeSmall organic molecule
Emp. Form.C24H18O4
Mol. Mass.370.3973
SMILESCC(=C)COc1cccc2c1C(=O)C=CC21Oc2cccc3cccc(O1)c23