Reaction Details
TargetThioredoxin reductase 3
LigandBDBM50218851
Substrate/Competitorn/a
Meas. Tech.ChEMBL_210563 (CHEMBL816515)
IC50 23200±n/a nM
Citation Wipf, PHopkins, TDJung, JKRodriguez, SBirmingham, ASouthwick, ECLazo, JSPowis, G New inhibitors of the thioredoxin-thioredoxin reductase system based on a naphthoquinone spiroketal natural product lead. Bioorg Med Chem Lett11:2637-41 (2001) Thioredoxin reductase 3
Name:Thioredoxin reductase 3
Type:PROTEIN
Mol. Mass.:70543.23
Organism:Homo sapiens (Human)
Description:ChEMBL_104858
Residue:642
BDBM50218851
NameBDBM50218851
Synonyms:CHEMBL88268 | SR-14
TypeSmall organic molecule
Emp. Form.C23H16O4
Mol. Mass.356.3707
SMILESC=CCOc1cccc2c1C(=O)C=CC21Oc2cccc3cccc(O1)c23