Reaction Details
TargetThioredoxin reductase 3
LigandBDBM50218854
Substrate/Competitorn/a
Meas. Tech.ChEMBL_210422 (CHEMBL811694)
IC50>50000±n/a nM
Citation Wipf, PHopkins, TDJung, JKRodriguez, SBirmingham, ASouthwick, ECLazo, JSPowis, G New inhibitors of the thioredoxin-thioredoxin reductase system based on a naphthoquinone spiroketal natural product lead. Bioorg Med Chem Lett11:2637-41 (2001) Thioredoxin reductase 3
Name:Thioredoxin reductase 3
Type:PROTEIN
Mol. Mass.:70543.23
Organism:Homo sapiens (Human)
Description:ChEMBL_104858
Residue:642
BDBM50218854
NameBDBM50218854
Synonyms:CHEMBL440697 | SR-13
TypeSmall organic molecule
Emp. Form.C26H17NO4
Mol. Mass.407.4175
SMILESO=C1C=CC2(Oc3cccc4cccc(O2)c34)c2cccc(OCc3ccncc3)c12