Reaction Details
TargetThioredoxin reductase 3
LigandBDBM50218810
Substrate/Competitorn/a
Meas. Tech.ChEMBL_210422 (CHEMBL811694)
IC50 50000±n/a nM
Citation Wipf, PHopkins, TDJung, JKRodriguez, SBirmingham, ASouthwick, ECLazo, JSPowis, G New inhibitors of the thioredoxin-thioredoxin reductase system based on a naphthoquinone spiroketal natural product lead. Bioorg Med Chem Lett11:2637-41 (2001) Thioredoxin reductase 3
Name:Thioredoxin reductase 3
Type:PROTEIN
Mol. Mass.:70543.23
Organism:Homo sapiens (Human)
Description:ChEMBL_104858
Residue:642
BDBM50218810
NameBDBM50218810
Synonyms:CHEMBL91726
TypeSmall organic molecule
Emp. Form.C23H14O4
Mol. Mass.354.3549
SMILESO=C1C=CC2(Oc3cccc4cccc(O2)c34)c2cccc(OCC#C)c12