Reaction Details
TargetD(3) dopamine receptor
LigandBDBM50219200
Substrate/Competitorn/a
Meas. Tech.ChEMBL_62455 (CHEMBL679227)
Ki 5.0±n/a nM
Citation Austin, NEAvenell, KYBoyfield, IBranch, CLHadley, MSJeffrey, PJohnson, CNMacdonald, GJNash, DJRiley, GJSmith, ABStemp, GThewlis, KMVong, AKWood, MD Design and synthesis of novel 2,3-dihydro-1H-isoindoles with high affinity and selectivity for the dopamine D3 receptor. Bioorg Med Chem Lett11:685-8 (2001) D(3) dopamine receptor
Name:D(3) dopamine receptor
Type:n/a
Mol. Mass.:44243.43
Organism:Homo sapiens (Human)
Description:n/a
Residue:400
BDBM50219200
NameBDBM50219200
Synonyms:CHEMBL158627
TypeSmall organic molecule
Emp. Form.C26H31FN2O4S
Mol. Mass.486.599
SMILESCS(=O)(=O)Oc1ccc2CN(CC[C@H]3CC[C@@H](CC3)NC(=O)\C=C\c3ccc(F)cc3)Cc2c1