Reaction Details
TargetAlpha-1B adrenergic receptor
LigandBDBM50217825
Substrate/Competitorn/a
Meas. Tech.ChEMBL_34624 (CHEMBL643905)
Ki 309±n/a nM
Citation Forbes, ITDouglas, SGribble, ADIfe, RJLightfoot, APGarner, AERiley, GJJeffrey, PStevens, AJStean, TOThomas, DR SB-656104-A: a novel 5-HT(7) receptor antagonist with improved in vivo properties. Bioorg Med Chem Lett12:3341-4 (2002) Alpha-1B adrenergic receptor
Name:Alpha-1B adrenergic receptor
Type:Enzyme
Mol. Mass.:56862.13
Organism:Homo sapiens (Human)
Description:P35368
Residue:520
BDBM50217825
NameBDBM50217825
Synonyms:CHEMBL323778
TypeSmall organic molecule
Emp. Form.C26H30N4O4S
Mol. Mass.494.606
SMILESO=c1oc2ccccc2n1C1CCN(CC[C@H]2CCCN2S(=O)(=O)c2ccc3cc[nH]c3c2)CC1