Reaction Details
Target5-hydroxytryptamine receptor 7
LigandBDBM50217827
Substrate/Competitorn/a
Meas. Tech.ChEMBL_3727 (CHEMBL619899)
Ki 6.5±n/a nM
Citation Forbes, ITDouglas, SGribble, ADIfe, RJLightfoot, APGarner, AERiley, GJJeffrey, PStevens, AJStean, TOThomas, DR SB-656104-A: a novel 5-HT(7) receptor antagonist with improved in vivo properties. Bioorg Med Chem Lett12:3341-4 (2002) 5-hydroxytryptamine receptor 7
Name:5-hydroxytryptamine receptor 7
Type:G Protein-Coupled Receptor (GPCR)
Mol. Mass.:53573.08
Organism:Homo sapiens (Human)
Description:P34969
Residue:479
BDBM50217827
NameBDBM50217827
Synonyms:CHEMBL112876
TypeSmall organic molecule
Emp. Form.C19H28N4O2S
Mol. Mass.376.516
SMILESCC1CCN(CC[C@H]2CCCN2S(=O)(=O)c2ccc3[nH]cnc3c2)CC1