Reaction Details
Target5-hydroxytryptamine receptor 7
LigandBDBM50217830
Substrate/Competitorn/a
Meas. Tech.ChEMBL_3727 (CHEMBL619899)
Ki 23±n/a nM
Citation Forbes, ITDouglas, SGribble, ADIfe, RJLightfoot, APGarner, AERiley, GJJeffrey, PStevens, AJStean, TOThomas, DR SB-656104-A: a novel 5-HT(7) receptor antagonist with improved in vivo properties. Bioorg Med Chem Lett12:3341-4 (2002) 5-hydroxytryptamine receptor 7
Name:5-hydroxytryptamine receptor 7
Type:G Protein-Coupled Receptor (GPCR)
Mol. Mass.:53573.08
Organism:Homo sapiens (Human)
Description:P34969
Residue:479
BDBM50217830
NameBDBM50217830
Synonyms:CHEMBL113192
TypeSmall organic molecule
Emp. Form.C20H31N3O2S
Mol. Mass.377.544
SMILESCC1CCN(CC[C@H]2CCCN2S(=O)(=O)c2ccc3CCNc3c2)CC1