Reaction Details
Target5-hydroxytryptamine receptor 7
LigandBDBM50217833
Substrate/Competitorn/a
Meas. Tech.ChEMBL_3727 (CHEMBL619899)
Ki 6.3±n/a nM
Citation Forbes, ITDouglas, SGribble, ADIfe, RJLightfoot, APGarner, AERiley, GJJeffrey, PStevens, AJStean, TOThomas, DR SB-656104-A: a novel 5-HT(7) receptor antagonist with improved in vivo properties. Bioorg Med Chem Lett12:3341-4 (2002) 5-hydroxytryptamine receptor 7
Name:5-hydroxytryptamine receptor 7
Type:G Protein-Coupled Receptor (GPCR)
Mol. Mass.:53573.08
Organism:Homo sapiens (Human)
Description:P34969
Residue:479
BDBM50217833
NameBDBM50217833
Synonyms:CHEMBL331803
TypeSmall organic molecule
Emp. Form.C27H32N4O2S
Mol. Mass.476.634
SMILESO=S(=O)(N1CCC[C@@H]1CCN1CCC(CC1)c1cc2ccccc2[nH]1)c1ccc2cc[nH]c2c1