Reaction Details
TargetAlpha-1B adrenergic receptor
LigandBDBM50217835
Substrate/Competitorn/a
Meas. Tech.ChEMBL_34624 (CHEMBL643905)
Ki 19±n/a nM
Citation Forbes, ITDouglas, SGribble, ADIfe, RJLightfoot, APGarner, AERiley, GJJeffrey, PStevens, AJStean, TOThomas, DR SB-656104-A: a novel 5-HT(7) receptor antagonist with improved in vivo properties. Bioorg Med Chem Lett12:3341-4 (2002) Alpha-1B adrenergic receptor
Name:Alpha-1B adrenergic receptor
Type:Enzyme
Mol. Mass.:56862.13
Organism:Homo sapiens (Human)
Description:P35368
Residue:520
BDBM50217835
NameBDBM50217835
Synonyms:CHEMBL114345
TypeSmall organic molecule
Emp. Form.C26H30FN3O3S
Mol. Mass.483.598
SMILESFc1ccc(cc1)C(=O)C1CCN(CC[C@H]2CCCN2S(=O)(=O)c2ccc3cc[nH]c3c2)CC1