Reaction Details
Target5-hydroxytryptamine receptor 1D
LigandBDBM50130261
Substrate/Competitorn/a
Meas. Tech.ChEMBL_1760 (CHEMBL616546)
Ki 25±n/a nM
Citation Forbes, ITDouglas, SGribble, ADIfe, RJLightfoot, APGarner, AERiley, GJJeffrey, PStevens, AJStean, TOThomas, DR SB-656104-A: a novel 5-HT(7) receptor antagonist with improved in vivo properties. Bioorg Med Chem Lett12:3341-4 (2002) 5-hydroxytryptamine receptor 1D
Name:5-hydroxytryptamine receptor 1D
Type:G Protein-Coupled Receptor (GPCR)
Mol. Mass.:41920.63
Organism:Homo sapiens (Human)
Description:Receptor binding assays were performed using human clone stably expressed in CHO cells.
Residue:377
BDBM50130261
NameBDBM50130261
Synonyms:6-(2-{2-[4-(4-Chloro-phenoxy)-piperidin-1-yl]-ethyl}-pyrrolidine-1-sulfonyl)-1H-indole; hydrochloride CHEMBL95104
TypeSmall organic molecule
Emp. Form.C25H30ClN3O3S
Mol. Mass.488.042
SMILESClc1ccc(OC2CCN(CC[C@H]3CCCN3S(=O)(=O)c3ccc4cc[nH]c4c3)CC2)cc1