Reaction Details
Target5-hydroxytryptamine receptor 7
LigandBDBM50217831
Substrate/Competitorn/a
Meas. Tech.ChEMBL_3727 (CHEMBL619899)
Ki 0.676083±n/a nM
Citation Forbes, ITDouglas, SGribble, ADIfe, RJLightfoot, APGarner, AERiley, GJJeffrey, PStevens, AJStean, TOThomas, DR SB-656104-A: a novel 5-HT(7) receptor antagonist with improved in vivo properties. Bioorg Med Chem Lett12:3341-4 (2002) 5-hydroxytryptamine receptor 7
Name:5-hydroxytryptamine receptor 7
Type:G Protein-Coupled Receptor (GPCR)
Mol. Mass.:53573.08
Organism:Homo sapiens (Human)
Description:P34969
Residue:479
BDBM50217831
NameBDBM50217831
Synonyms:CHEMBL430706
TypeSmall organic molecule
Emp. Form.C27H32N4O2S
Mol. Mass.476.634
SMILESO=S(=O)(N1CCC[C@@H]1CCN1CCC(CC1)c1c[nH]c2ccccc12)c1ccc2cc[nH]c2c1