Reaction Details
TargetHistone deacetylase (HDAC1 and HDAC2)
LigandBDBM50220805
Substrate/Competitorn/a
Meas. Tech.ChEMBL_87404 (CHEMBL693168)
IC50 3.1±n/a nM
Citation Dai, YGuo, YGuo, JPease, LJLi, JMarcotte, PAGlaser, KBTapang, PAlbert, DHRichardson, PLDavidsen, SKMichaelides, MR Indole amide hydroxamic acids as potent inhibitors of histone deacetylases. Bioorg Med Chem Lett13:1897-901 (2003) Histone deacetylase (HDAC1 and HDAC2)
Name:Histone deacetylase (HDAC1 and HDAC2)
Type:n/a
Mol. Mass.:n/a
Description:ASSAY_ID of ChEMBL is 2197604
Components:This complex has 2 components.
Component 1
Name:Histone deacetylase 1
Synonyms:Cereblon/Histone deacetylase 1 HDAC1 Histone deacetylase 1 (HDAC1) RPD3L1
Type:Enzyme
Mol. Mass.:55090.27
Organism:Homo sapiens (Human)
Description:Q13547
Residue:482
Component 2
Name:Histone deacetylase 2
Synonyms:Cereblon/Histone deacetylase 2 HDAC2 Histone deacetylase 2 (HDAC2) | Human HDAC2
Type:Chromatin regulator; hydrolase; repressor
Mol. Mass.:55356.54
Organism:Homo sapiens (Human)
Description:Q92769
Residue:488
BDBM50220805
NameBDBM50220805
Synonyms:CHEMBL294194
TypeSmall organic molecule
Emp. Form.C18H25N3O5
Mol. Mass.363.4082
SMILESCOc1cc(OC)c2cc([nH]c2c1)C(=O)NCCCCCCC(=O)NO