Reaction Details
TargetcAMP-specific 3',5'-cyclic phosphodiesterase 4C
LigandBDBM50221004
Substrate/Competitorn/a
Meas. Tech.ChEMBL_157228 (CHEMBL769552)
IC50 1.6±n/a nM
Citation Kim, EChun, HOJung, SHKim, JHLee, JMSuh, BCXiang, MXRhee, CK Improvement of therapeutic index of phosphodiesterase type IV inhibitors as anti-Asthmatics. Bioorg Med Chem Lett13:2355-8 (2003) cAMP-specific 3',5'-cyclic phosphodiesterase 4C
Name:cAMP-specific 3',5'-cyclic phosphodiesterase 4C
Type:PROTEIN
Mol. Mass.:60038.21
Organism:Rattus norvegicus
Description:ChEMBL_104732
Residue:536
BDBM50221004
NameBDBM50221004
Synonyms:CHEMBL77999
TypeSmall organic molecule
Emp. Form.C20H24N4O2
Mol. Mass.352.4302
SMILES[#6]-[#8]-c1ccc(cc1-[#8]-[#6]-1-[#6]-[#6]-[#6]-[#6]-1)-[#6](=[#7]\[#7]=[#6](/[#7])-[#7])\c1ccccc1