Reaction Details
TargetcAMP-specific 3',5'-cyclic phosphodiesterase 4C
LigandBDBM50221003
Substrate/Competitorn/a
Meas. Tech.ChEMBL_157378 (CHEMBL763643)
Ki 0.069000±n/a nM
Citation Kim, EChun, HOJung, SHKim, JHLee, JMSuh, BCXiang, MXRhee, CK Improvement of therapeutic index of phosphodiesterase type IV inhibitors as anti-Asthmatics. Bioorg Med Chem Lett13:2355-8 (2003) cAMP-specific 3',5'-cyclic phosphodiesterase 4C
Name:cAMP-specific 3',5'-cyclic phosphodiesterase 4C
Type:PROTEIN
Mol. Mass.:60038.21
Organism:Rattus norvegicus
Description:ChEMBL_104732
Residue:536
BDBM50221003
NameBDBM50221003
Synonyms:CHEMBL432348
TypeSmall organic molecule
Emp. Form.C14H19N3O3
Mol. Mass.277.319
SMILESCOc1ccc(\C=N\NC(N)=O)cc1OC1CCCC1