Reaction Details
TargetcAMP-specific 3',5'-cyclic phosphodiesterase 4C
LigandBDBM50221001
Substrate/Competitorn/a
Meas. Tech.ChEMBL_157378 (CHEMBL763643)
Ki 2.0±n/a nM
Citation Kim, EChun, HOJung, SHKim, JHLee, JMSuh, BCXiang, MXRhee, CK Improvement of therapeutic index of phosphodiesterase type IV inhibitors as anti-Asthmatics. Bioorg Med Chem Lett13:2355-8 (2003) cAMP-specific 3',5'-cyclic phosphodiesterase 4C
Name:cAMP-specific 3',5'-cyclic phosphodiesterase 4C
Type:PROTEIN
Mol. Mass.:60038.21
Organism:Rattus norvegicus
Description:ChEMBL_104732
Residue:536
BDBM50221001
NameBDBM50221001
Synonyms:CHEMBL76257
TypeSmall organic molecule
Emp. Form.C21H24N2O3
Mol. Mass.352.4269
SMILESCOc1ccc(cc1OC1CCCC1)C(=N\NC(C)=O)\c1ccccc1