Reaction Details
TargetPhospho-N-acetylmuramoyl-pentapeptide-transferase
LigandBDBM50135599
Substrate/Competitorn/a
Meas. Tech.ChEMBL_208267 (CHEMBL813227)
IC50 17.6±n/a nM
Citation Hotoda, HDaigo, MFurukawa, MMurayama, KHasegawa, CAKaneko, MMuramatsu, YIshii, MMMiyakoshi, STakatsu, TInukai, MKakuta, MAbe, TFukuoka, TUtsui, YOhya, S Synthesis and antimycobacterial activity of capuramycin analogues. Part 2: acylated derivatives of capuramycin-related compounds. Bioorg Med Chem Lett13:2833-6 (2003) Phospho-N-acetylmuramoyl-pentapeptide-transferase
Name:Phospho-N-acetylmuramoyl-pentapeptide-transferase
Type:PROTEIN
Mol. Mass.:39889.38
Organism:Escherichia coli (strain K12)
Description:ChEMBL_1454117
Residue:360
BDBM50135599
NameBDBM50135599
Synonyms:(4S,5S,6S)-6-{(R)-Carbamoyl-[(2S,3S,4R,5R)-5-(2,4-dioxo-3,4-dihydro-2H-pyrimidin-1-yl)-4-hydroxy-3-methoxy-tetrahydro-furan-2-yl]-methoxy}-4,5-dihydroxy-5,6-dihydro-4H-pyran-2-carboxylic acid ((S)-2-oxo-azepan-3-yl)-amide | CHEMBL96695
TypeSmall organic molecule
Emp. Form.C23H31N5O12
Mol. Mass.569.5185
SMILESCO[C@H]1[C@@H](O)[C@@H](O[C@@H]1[C@@H](O[C@H]1OC(=C[C@H](O)[C@@H]1O)C(=O)N[C@H]1CCCCNC1=O)C(N)=O)n1ccc(=O)[nH]c1=O