Reaction Details
TargetHistone deacetylase (HDAC1 and HDAC2)
LigandBDBM50222343
Substrate/Competitorn/a
Meas. Tech.ChEMBL_87402 (CHEMBL693166)
IC50 2.7±n/a nM
Citation Dai, YGuo, YCurtin, MLLi, JPease, LJGuo, JMarcotte, PAGlaser, KBDavidsen, SKMichaelides, MR A novel series of histone deacetylase inhibitors incorporating hetero aromatic ring systems as connection units. Bioorg Med Chem Lett13:3817-20 (2003) Histone deacetylase (HDAC1 and HDAC2)
Name:Histone deacetylase (HDAC1 and HDAC2)
Type:n/a
Mol. Mass.:n/a
Description:ASSAY_ID of ChEMBL is 2197604
Components:This complex has 2 components.
Component 1
Name:Histone deacetylase 1
Synonyms:Cereblon/Histone deacetylase 1 HDAC1 Histone deacetylase 1 (HDAC1) RPD3L1
Type:Enzyme
Mol. Mass.:55090.27
Organism:Homo sapiens (Human)
Description:Q13547
Residue:482
Component 2
Name:Histone deacetylase 2
Synonyms:Cereblon/Histone deacetylase 2 HDAC2 Histone deacetylase 2 (HDAC2) | Human HDAC2
Type:Chromatin regulator; hydrolase; repressor
Mol. Mass.:55356.54
Organism:Homo sapiens (Human)
Description:Q92769
Residue:488
BDBM50222343
NameBDBM50222343
Synonyms:CHEMBL339720
TypeSmall organic molecule
Emp. Form.C16H19BrN2O3
Mol. Mass.367.238
SMILESONC(=O)CCCCCCc1ncc(o1)-c1ccc(Br)cc1