Reaction Details
TargetDelta-type opioid receptor/Kappa-type opioid receptor/Mu-type opioid receptor/Sigma non-opioid intracellular receptor 1
LigandBDBM50008984
Substrate/Competitorn/a
Meas. Tech.ChEMBL_146294 (CHEMBL758842)
IC50 25±n/a nM
Citation Burke, TRJacobson, AERice, KCSilverton, JVSimonds, WFStreaty, RAKlee, WA Probes for narcotic receptor mediated phenomena. 12. cis-(+)-3-Methylfentanyl isothiocyanate, a potent site-directed acylating agent for delta opioid receptors. Synthesis, absolute configuration, and receptor enantioselectivity. J Med Chem29:1087-93 (1986) Delta-type opioid receptor/Kappa-type opioid receptor/Mu-type opioid receptor/Sigma non-opioid intracellular receptor 1
Name:Delta-type opioid receptor/Kappa-type opioid receptor/Mu-type opioid receptor/Sigma non-opioid intracellular receptor 1
Synonyms:Opioid receptor
Type:n/a
Mol. Mass.:n/a
Description:ASSAY_ID of ChEMBL is 172778
Components:This complex has 4 components.
Component 1
Name:Mu-type opioid receptor
Type:G Protein-Coupled Receptor (GPCR)
Mol. Mass.:44503.11
Organism:Rattus norvegicus (rat)
Description:Competition binding assays were carried out using membrane preparations from transfected HN9.10 cells that constitutively expressed the mu opioid receptor.
Residue:398
Component 2
Name:Sigma non-opioid intracellular receptor 1
Synonyms:Opioid receptor SGMR1_RAT Sigma non-opioid intracellular receptor 1 Sigma-1 | Sigmar1
Type:Enzyme Catalytic Domain
Mol. Mass.:25266.54
Organism:RAT
Description:Q9R0C9
Residue:223
Component 3
Name:Kappa-type opioid receptor
Synonyms:KOR-1 OPIATE Kappa Opioid receptor Ror-d
Type:G Protein-Coupled Receptor (GPCR)
Mol. Mass.:42692.90
Organism:Rattus norvegicus (rat)
Description:P34975
Residue:380
Component 4
Name:Delta-type opioid receptor
Synonyms:Cytochrome P450 3A4 Delta opioid receptor Delta-type opioid receptor (DOR) OPRD_RAT Opioid receptor Opioid receptors; mu & delta Ror-a | Voltage-gated potassium channel
Type:G Protein-Coupled Receptor (GPCR)
Mol. Mass.:40465.04
Organism:Rattus norvegicus (rat)
Description:Competition binding assays were using CHO-K1 cell membranes expressing the opioid receptor.
Residue:372
BDBM50008984
NameBDBM50008984
Synonyms:4-(4-Chloro-benzyl)-2-(1-methyl-azepan-4-yl)-2H-phthalazin-1-one Duragesic-100 Duragesic-25 Duragesic-75 FENTANYL CITRATE Fentanyl-100 Fentanyl-25 Fentanyl-75 Innovar N-(1-Phenethyl-piperidin-4-yl)-N-phenyl-propionamide N-(1-phenethylpiperidin-4-yl)-N-phenylpropionamide | US20230399418, Compound Fentanyl
TypeSmall organic molecule
Emp. Form.C22H28N2O
Mol. Mass.336.4705
SMILESCCC(=O)N(C1CCN(CCc2ccccc2)CC1)c1ccccc1