Reaction Details
Target5-hydroxytryptamine receptor 3A
LigandBDBM50222218
Substrate/Competitorn/a
Meas. Tech.ChEMBL_3109 (CHEMBL620587)
Ki 252±n/a nM
Citation Rosen, TSeeger, TFMcLean, SNagel, AAIves, JLGuarino, KJBryce, DFurman, JRoth, RWChalabi, PM Synthesis, in vitro binding profile, and central nervous system penetrability of the highly potent 5-HT3 receptor antagonist [3H]-4-(2-methoxyphenyl)-2-[4(5)-methyl-5(4)-imidazolylmethyl]thiazole. J Med Chem33:3020-3 (1990) 5-hydroxytryptamine receptor 3A
Name:5-hydroxytryptamine receptor 3A
Type:n/a
Mol. Mass.:56056.00
Organism:Mus musculus (house mouse)
Description:5HT3A
Residue:487
BDBM50222218
NameBDBM50222218
Synonyms:CHEBI:51137 | Mianserin
TypeSmall organic molecule
Emp. Form.C18H20N2
Mol. Mass.264.3648
SMILESCN1CCN2C(C1)c1ccccc1Cc1ccccc21