Reaction Details
TargetType-1/Type-2 angiotensin II receptor
LigandBDBM50229912
Substrate/Competitorn/a
Meas. Tech.ChEMBL_36327 (CHEMBL650154)
IC50 0.300000±n/a nM
Citation Mantlo, NBChakravarty, PKOndeyka, DLSiegl, PKChang, RSLotti, VJFaust, KAChen, TBSchorn, TWSweet, CS Potent, orally active imidazo[4,5-b]pyridine-based angiotensin II receptor antagonists. J Med Chem34:2919-22 (1991) Type-1/Type-2 angiotensin II receptor
Name:Type-1/Type-2 angiotensin II receptor
Synonyms:Angiotensin II receptor
Type:n/a
Mol. Mass.:n/a
Description:ASSAY_ID of ChEMBL is 357784
Components:This complex has 2 components.
Component 1
Name:Type-1 angiotensin II receptor
Type:Protein
Mol. Mass.:41080.75
Organism:Homo sapiens (Human)
Description:P30556
Residue:359
Component 2
Name:Type-2 angiotensin II receptor
Synonyms:AGTR2 AT2 Angiotensin II type 2 (AT-2) receptor Type-2 angiotensin II receptor
Type:Enzyme Catalytic Domain
Mol. Mass.:41201.61
Organism:Homo sapiens (Human)
Description:Angiotensin II, central 0 0::P50052
Residue:363
BDBM50229912
NameBDBM50229912
Synonyms:CHEMBL315104
TypeSmall organic molecule
Emp. Form.C25H25N7
Mol. Mass.423.5129
SMILESCCCc1nc2c(C)cc(C)nc2n1Cc1ccc(cc1)-c1ccccc1-c1nn[nH]n1