Reaction Details
TargetDelta-type/Kappa-type/Mu-type opioid receptor
LigandBDBM50000087
Substrate/Competitorn/a
Meas. Tech.ChEMBL_145872 (CHEMBL754077)
IC50 150±n/a nM
Citation Judd, DBBrown, DSLloyd, JEMcElroy, ABScopes, DIBirch, PJHayes, AGSheehan, MJ Synthesis, antinociceptive activity, and opioid receptor profiles of substituted trans-3-(decahydro- and octahydro-4a-isoquinolinyl)phenols. J Med Chem35:48-56 (1992) Delta-type/Kappa-type/Mu-type opioid receptor
Name:Delta-type/Kappa-type/Mu-type opioid receptor
Synonyms:Opioid receptors; mu/kappa/delta
Type:n/a
Mol. Mass.:n/a
Description:ASSAY_ID of ChEMBL is 357797
Components:This complex has 3 components.
Component 1
Name:Mu-type opioid receptor
Type:G Protein-Coupled Receptor (GPCR)
Mol. Mass.:44789.51
Organism:Homo sapiens (Human)
Description:P35372
Residue:400
Component 2
Name:Kappa-type opioid receptor
Synonyms:K-OR-1 Kappa-opioid receptor (KOR) Kappa-type opioid receptor (KOR) OPIATE Kappa OPRK1 kappa opioid receptor (KOR)
Type:G Protein-Coupled Receptor (GPCR)
Mol. Mass.:42648.76
Organism:Homo sapiens (Human)
Description:P41145
Residue:380
Component 3
Name:Delta-type opioid receptor
Synonyms:D-OR-1 Delta opioid receptor OPIATE Delta OPRD1 OPRK1 | opioid receptor, delta 1
Type:G Protein-Coupled Receptor (GPCR)
Mol. Mass.:40382.98
Organism:Homo sapiens (Human)
Description:Competition binding assays were carried out using membrane preparations from transfected HN9.10 cells that constitutively expressed the delta opioid receptor.
Residue:372
BDBM50000087
NameBDBM50000087
Synonyms:3-(2-Cyclopropylmethyl-octahydro-isoquinolin-4a-yl)-phenol | CHEMBL153538
TypeSmall organic molecule
Emp. Form.C19H27NO
Mol. Mass.285.4238
SMILESOc1cccc(c1)C12CCCC[C@H]1CN(CC1CC1)CC2