Reaction Details
TargetOrexin/Hypocretin receptor type 1
LigandBDBM50230033
Substrate/Competitorn/a
Meas. Tech.ChEBML_1644403
Ki 12±n/a nM
Citation Nagase, HYamamoto, NYata, MOhrui, SOkada, TSaitoh, TKutsumura, NNagumo, YIrukayama-Tomobe, YIshikawa, YOgawa, YHirayama, SKuroda, DWatanabe, YGouda, HYanagisawa, M Design and Synthesis of Potent and Highly Selective Orexin 1 Receptor Antagonists with a Morphinan Skeleton and Their Pharmacologies. J Med Chem60:1018-1040 (2017) 
 
Orexin/Hypocretin receptor type 1
Name:Orexin/Hypocretin receptor type 1
Type:Protein
Mol. Mass.:47554.50
Organism:Homo sapiens (Human)
Description:O43613
Residue:425
BDBM50230033
NameBDBM50230033
Synonyms:CHEMBL4062717 | US10377763, Example 34
TypeSmall organic molecule
Emp. Form.C29H32N2O6
Mol. Mass.504.5742
SMILES[H][C@@]12Oc3c4c(C[C@@]5([H])N(CC[C@@]14[C@@]5(O)CC[C@H]2N(C)C(=O)\C=C\c1ccoc1)C(=O)C1CC1)ccc3OC