Reaction Details
TargetPeptidyl-prolyl cis-trans isomerase A
LigandBDBM50230211
Substrate/Competitorn/a
Meas. Tech.ChEMBL_1644715 (CHEMBL3993644)
Ki 4.3±n/a nM
Citation Steadman, VAPettit, SBPoullennec, KGLazarides, LKeats, AJDean, DKStanway, SJAustin, CASanvoisin, JAWatt, GMFliri, HGLiclican, ACJin, DWong, MHLeavitt, SALee, YJTian, YFrey, CRAppleby, TCSchmitz, UJansa, PMackman, RLSchultz, BE Discovery of Potent Cyclophilin Inhibitors Based on the Structural Simplification of Sanglifehrin A. J Med Chem60:1000-1017 (2017) 
 
Peptidyl-prolyl cis-trans isomerase A
Name:Peptidyl-prolyl cis-trans isomerase A
Type:Protein
Mol. Mass.:18015.32
Organism:Homo sapiens (Human)
Description:P62937
Residue:165
BDBM50230211
NameBDBM50230211
Synonyms:CHEMBL4063126
TypeSmall organic molecule
Emp. Form.C28H40N4O5
Mol. Mass.512.641
SMILESCC(C)[C@@H]1NC(=O)CCCC\C=C\c2cccc(c2)[C@@H](C)OC(=O)[C@@H]2CCCN(N2)C(=O)[C@H](C)NC1=O