Reaction Details
TargetAdenosine receptor A2b
LigandBDBM50232058
Substrate/Competitorn/a
Meas. Tech.ChEMBL_1646018 (CHEMBL3995074)
Ki 1.2±n/a nM
Citation Basu, SBarawkar, DARamdas, VWaman, YPatel, MPanmand, AKumar, SThorat, SBonagiri, RJadhav, DMukhopadhyay, PPrasad, VReddy, BSGoswami, AChaturvedi, SMenon, SQuraishi, AGhosh, IDusange, SPaliwal, SKulkarni, AKarande, VThakre, RBedse, GRouduri, SGundu, JPalle, VPChugh, AMookhtiar, KA A Eur J Med Chem127:986-996 (2017) 
 
Adenosine receptor A2b
Name:Adenosine receptor A2b
Type:G Protein-Coupled Receptor (GPCR)
Mol. Mass.:36341.22
Organism:Homo sapiens (Human)
Description:n/a
Residue:332
BDBM50232058
NameBDBM50232058
Synonyms:CHEMBL4092455
TypeSmall organic molecule
Emp. Form.C27H30F3N7O4
Mol. Mass.573.5668
SMILESCCCn1c2nc([nH]c2c(=O)n(CCC)c1=O)-c1cnn(CC(O)C2CN(C(=O)C2)c2cccc(c2)C(F)(F)F)c1