Reaction Details
TargetAdenosine receptor A2b
LigandBDBM50232062
Substrate/Competitorn/a
Meas. Tech.ChEMBL_1646018 (CHEMBL3995074)
Ki 0.900000±n/a nM
Citation Basu, SBarawkar, DARamdas, VWaman, YPatel, MPanmand, AKumar, SThorat, SBonagiri, RJadhav, DMukhopadhyay, PPrasad, VReddy, BSGoswami, AChaturvedi, SMenon, SQuraishi, AGhosh, IDusange, SPaliwal, SKulkarni, AKarande, VThakre, RBedse, GRouduri, SGundu, JPalle, VPChugh, AMookhtiar, KA A Eur J Med Chem127:986-996 (2017) 
 
Adenosine receptor A2b
Name:Adenosine receptor A2b
Type:G Protein-Coupled Receptor (GPCR)
Mol. Mass.:36341.22
Organism:Homo sapiens (Human)
Description:n/a
Residue:332
BDBM50232062
NameBDBM50232062
Synonyms:CHEMBL4068507
TypeSmall organic molecule
Emp. Form.C27H31F3N8O3
Mol. Mass.572.582
SMILESCCCn1c2nc([nH]c2c(=O)n(CCC)c1=O)-c1cnn(CC(=O)N2CCN(CC2)c2ccc(cc2)C(F)(F)F)c1