Reaction Details
Target5-hydroxytryptamine receptor 3A
LigandBDBM50232595
Substrate/Competitorn/a
Meas. Tech.ChEBML_1648184
IC50 27±n/a nM
Citation Iwuagwu, CKing, DMcDonald, IMCook, JZusi, FCHill, MDMate, RAFang, HKnox, RGallagher, LPost-Munson Amy Easton, DMiller, RBenitex, YSiuciak, JLodge, NZaczek, RMorgan, DBristow, LMacor, JEOlson, RE Design and synthesis of a novel series of 4-heteroarylamino-1'-azaspiro[oxazole-5,3'-bicyclo[2.2.2]octanes asa7 nicotinic receptor agonists 2. Development of 4-heteroaryl SAR. Bioorg Med Chem Lett27:1261-1266 (2017) 
 
5-hydroxytryptamine receptor 3A
Name:5-hydroxytryptamine receptor 3A
Type:Protein
Mol. Mass.:55283.27
Organism:Homo sapiens (Human)
Description:P46098
Residue:478
BDBM50232595
NameBDBM50232595
Synonyms:CHEMBL4100355
TypeSmall organic molecule
Emp. Form.C13H17N5O
Mol. Mass.259.307
SMILESC1N=C(Nc2ncccn2)O[C@]11CN2CCC1CC2