Reaction Details
Target5-hydroxytryptamine receptor 3A
LigandBDBM50232605
Substrate/Competitorn/a
Meas. Tech.ChEBML_1648184
IC50 350±n/a nM
Citation Iwuagwu, CKing, DMcDonald, IMCook, JZusi, FCHill, MDMate, RAFang, HKnox, RGallagher, LPost-Munson Amy Easton, DMiller, RBenitex, YSiuciak, JLodge, NZaczek, RMorgan, DBristow, LMacor, JEOlson, RE Design and synthesis of a novel series of 4-heteroarylamino-1'-azaspiro[oxazole-5,3'-bicyclo[2.2.2]octanes asa7 nicotinic receptor agonists 2. Development of 4-heteroaryl SAR. Bioorg Med Chem Lett27:1261-1266 (2017) 
 
5-hydroxytryptamine receptor 3A
Name:5-hydroxytryptamine receptor 3A
Type:Protein
Mol. Mass.:55283.27
Organism:Homo sapiens (Human)
Description:P46098
Residue:478
BDBM50232605
NameBDBM50232605
Synonyms:CHEMBL4077222
TypeSmall organic molecule
Emp. Form.C13H16ClN5O
Mol. Mass.293.752
SMILESClc1cnc(NC2=NC[C@@]3(CN4CCC3CC4)O2)cn1