Reaction Details
Target5-hydroxytryptamine receptor 2A
LigandBDBM35254
Substrate/Competitorn/a
Meas. Tech.ChEMBL_1648450 (CHEMBL3997506)
Ki 6.2±n/a nM
Citation Staron, JMordalski, SWarszycki, DSatala, GHogendorf, ABojarski, AJ Pyrano[2,3,4- ACS Med Chem Lett8:390-394 (2017) 
 
5-hydroxytryptamine receptor 2A
Name:5-hydroxytryptamine receptor 2A
Type:undefined
Mol. Mass.:52607.65
Organism:Homo sapiens (Human)
Description:P28223
Residue:471
BDBM35254
NameBDBM35254
Synonyms:2-methyl-4-(4-methylpiperazin-1-yl)-10H-thieno[2,3-b][1,5]benzodiazepine Olansek Zyprexa | olanzapine
TypeSmall organic molecule
Emp. Form.C17H20N4S
Mol. Mass.312.432
SMILESCN1CCN(CC1)C1=Nc2ccccc2Nc2sc(C)cc12