Reaction Details
TargetDual specificity mitogen-activated protein kinase kinase 6
LigandBDBM50232968
Substrate/Competitorn/a
Meas. Tech.ChEMBL_1649690 (CHEMBL3998824)
IC50>10000±n/a nM
Citation Cho, HSengupta, SJeon, SSHur, WChoi, HGSeo, HSLee, BJKim, JHChung, MJeon, NLKim, NDSim, T Identification of the First Selective Activin Receptor-Like Kinase 1 Inhibitor, a Reversible Version of L-783277. J Med Chem60:1495-1508 (2017) 
 
Dual specificity mitogen-activated protein kinase kinase 6
Name:Dual specificity mitogen-activated protein kinase kinase 6
Type:Protein
Mol. Mass.:37494.96
Organism:Homo sapiens (Human)
Description:P52564
Residue:334
BDBM50232968
NameBDBM50232968
Synonyms:CHEMBL4099337
TypeSmall organic molecule
Emp. Form.C19H26O7
Mol. Mass.366.4055
SMILESCOc1cc(O)c2c(CCC[C@H](O)[C@H](O)C(=O)CCC[C@H](C)OC2=O)c1