Reaction Details
TargetReceptor-interacting serine/threonine-protein kinase 1
LigandBDBM50159697
Substrate/Competitorn/a
Meas. Tech.ChEMBL_1650162 (CHEMBL3999296)
IC50 0.063000±n/a nM
Citation Harris, PABerger, SBJeong, JUNagilla, RBandyopadhyay, DCampobasso, NCapriotti, CACox, JADare, LDong, XEidam, PMFinger, JNHoffman, SJKang, JKasparcova, VKing, BWLehr, RLan, YLeister, LKLich, JDMacDonald, TTMiller, NAOuellette, MTPao, CSRahman, AReilly, MARendina, ARRivera, EJSchaeffer, MCSehon, CASinghaus, RRSun, HHSwift, BATotoritis, RDVossenkämper, AWard, PWisnoski, DDZhang, DMarquis, RWGough, PJBertin, J Discovery of a First-in-Class Receptor Interacting Protein 1 (RIP1) Kinase Specific Clinical Candidate (GSK2982772) for the Treatment of Inflammatory Diseases. J Med Chem60:1247-1261 (2017) 
 
Receptor-interacting serine/threonine-protein kinase 1
Name:Receptor-interacting serine/threonine-protein kinase 1
Type:Enzyme Catalytic Domain
Mol. Mass.:75926.99
Organism:Homo sapiens (Human)
Description:Q13546
Residue:671
BDBM50159697
NameBDBM50159697
Synonyms:CHEMBL3785745
TypeSmall organic molecule
Emp. Form.C21H19N3O3S
Mol. Mass.393.459
SMILESCN1c2ccccc2SC[C@H](NC(=O)c2cc(Cc3ccccc3)on2)C1=O