Reaction Details
TargetMelanin-concentrating hormone receptor 1
LigandBDBM50233625
Substrate/Competitorn/a
Meas. Tech.ChEMBL_1651024 (CHEMBL4000279)
IC50 4191±n/a nM
Citation Szabo, MLim, HDHerenbrink, CKChristopoulos, ALane, JRCapuano, B Proof of concept study for designed multiple ligands targeting the dopamine D2, serotonin 5-HT2A, and muscarinic M1 acetylcholine receptors. J Med Chem58:1550-5 (2015) 
 
Melanin-concentrating hormone receptor 1
Name:Melanin-concentrating hormone receptor 1
Type:G Protein-Coupled Receptor (GPCR)
Mol. Mass.:45976.27
Organism:Homo sapiens (Human)
Description:Membranes from CHO-K1 cells stably expressing human MCH1R were used in assays.
Residue:422
BDBM50233625
NameBDBM50233625
Synonyms:CHEMBL4090568
TypeSmall organic molecule
Emp. Form.C22H24N4O2S
Mol. Mass.408.517
SMILESO=C1COc2ccccc2N1CCCN1CCN(CC1)c1nsc2ccccc12