Reaction Details
TargetMelanin-concentrating hormone receptor 1
LigandBDBM50233626
Substrate/Competitorn/a
Meas. Tech.ChEMBL_1651024 (CHEMBL4000279)
IC50 3253±n/a nM
Citation Szabo, MLim, HDHerenbrink, CKChristopoulos, ALane, JRCapuano, B Proof of concept study for designed multiple ligands targeting the dopamine D2, serotonin 5-HT2A, and muscarinic M1 acetylcholine receptors. J Med Chem58:1550-5 (2015) 
 
Melanin-concentrating hormone receptor 1
Name:Melanin-concentrating hormone receptor 1
Type:G Protein-Coupled Receptor (GPCR)
Mol. Mass.:45976.27
Organism:Homo sapiens (Human)
Description:Membranes from CHO-K1 cells stably expressing human MCH1R were used in assays.
Residue:422
BDBM50233626
NameBDBM50233626
Synonyms:CHEMBL4062602
TypeSmall organic molecule
Emp. Form.C23H24FN3O3
Mol. Mass.409.4534
SMILESFc1ccc2c(noc2c1)C1CCN(CCCN2C(=O)COc3ccccc23)CC1