Reaction Details
TargetD(2) dopamine receptor
LigandBDBM50233623
Substrate/Competitorn/a
Meas. Tech.ChEMBL_1651022 (CHEMBL4000277)
Ki 1.7±n/a nM
Citation Szabo, MLim, HDHerenbrink, CKChristopoulos, ALane, JRCapuano, B Proof of concept study for designed multiple ligands targeting the dopamine D2, serotonin 5-HT2A, and muscarinic M1 acetylcholine receptors. J Med Chem58:1550-5 (2015) 
 
D(2) dopamine receptor
Name:D(2) dopamine receptor
Type:Cell-surface receptors
Mol. Mass.:50647.10
Organism:Homo sapiens (Human)
Description:P14416
Residue:443
BDBM50233623
NameBDBM50233623
Synonyms:CHEMBL4104013
TypeSmall organic molecule
Emp. Form.C22H24N4O4
Mol. Mass.408.4504
SMILESO=C1COc2ccccc2N1CCCN1CCN(CC1)c1cccc2[nH]c(=O)oc12