Reaction Details
TargetDynamin-2
LigandBDBM50233981
Substrate/Competitorn/a
Meas. Tech.ChEMBL_1651871 (CHEMBL4001126)
IC50 4000±n/a nM
Citation Odell, LRAbdel-Hamid, MKHill, TAChau, NYoung, KADeane, FMSakoff, JAAndersson, SDaniel, JARobinson, PJMcCluskey, A Pyrimidine-Based Inhibitors of Dynamin I GTPase Activity: Competitive Inhibition at the Pleckstrin Homology Domain. J Med Chem60:349-361 (2017) 
 
Dynamin-2
Name:Dynamin-2
Type:PROTEIN
Mol. Mass.:98071.19
Organism:Homo sapiens (Human)
Description:ChEMBL_934670
Residue:870
BDBM50233981
NameBDBM50233981
Synonyms:CHEMBL4060114
TypeSmall organic molecule
Emp. Form.C15H29N5
Mol. Mass.279.4243
SMILESCCCCCCNc1cc(C)nc(NCCN(C)C)n1