Reaction Details
TargetDynamin-2
LigandBDBM50233989
Substrate/Competitorn/a
Meas. Tech.ChEMBL_1651873 (CHEMBL4001128)
IC50 8700±n/a nM
Citation Odell, LRAbdel-Hamid, MKHill, TAChau, NYoung, KADeane, FMSakoff, JAAndersson, SDaniel, JARobinson, PJMcCluskey, A Pyrimidine-Based Inhibitors of Dynamin I GTPase Activity: Competitive Inhibition at the Pleckstrin Homology Domain. J Med Chem60:349-361 (2017) 
 
Dynamin-2
Name:Dynamin-2
Type:PROTEIN
Mol. Mass.:98071.19
Organism:Homo sapiens (Human)
Description:ChEMBL_934670
Residue:870
BDBM50233989
NameBDBM50233989
Synonyms:CHEMBL4090457
TypeSmall organic molecule
Emp. Form.C17H33N5
Mol. Mass.307.4774
SMILESCCCCCCCCNc1cc(C)nc(NCCN(C)C)n1