Reaction Details
TargetReceptor-type tyrosine-protein kinase FLT3
LigandBDBM50193112
Substrate/Competitorn/a
Meas. Tech.ChEMBL_1652603 (CHEMBL4001858)
IC50 11±n/a nM
Citation Oh, CKim, HKang, JSYun, JSim, JKim, HMHan, G Synthetic strategy for increasing solubility of potential FLT3 inhibitor thieno[2,3-d]pyrimidine derivatives through structural modifications at the C Bioorg Med Chem Lett27:496-500 (2017) 
 
Receptor-type tyrosine-protein kinase FLT3
Name:Receptor-type tyrosine-protein kinase FLT3
Type:Enzyme
Mol. Mass.:112888.62
Organism:Homo sapiens (Human)
Description:P36888
Residue:993
BDBM50193112
NameBDBM50193112
Synonyms:CHEMBL3966536
TypeSmall organic molecule
Emp. Form.C25H24ClN5O3S2
Mol. Mass.542.073
SMILESCl.CNCCOc1ccc(cc1)-c1sc2nc(nc(NN3C(=O)C=C(C)C3=O)c2c1C)-c1cccs1