Reaction Details
TargetEpidermal growth factor receptor
LigandBDBM50322535
Substrate/Competitorn/a
Meas. Tech.ChEMBL_1653405 (CHEMBL4002771)
IC50>1000±n/a nM
Citation Liu, YPeng, XGuan, XLu, DXi, YJin, SChen, HZeng, LAi, JGeng, MHu, Y Discovery of novel Ponatinib analogues for reducing KDR activity as potent FGFRs inhibitors. Eur J Med Chem126:122-132 (2017) 
 
Epidermal growth factor receptor
Name:Epidermal growth factor receptor
Type:Receptor Kinase Domain
Mol. Mass.:134279.59
Organism:Homo sapiens (Human)
Description:P00533
Residue:1210
BDBM50322535
NameBDBM50322535
Synonyms:3-(imidazo[1,2-b]pyridazin-3-ylethynyl)-4-methyl-N-{4-[(4-methylpiperazin-1-yl)methyl]-3-(trifluoromethyl)phenyl}benzamide CHEMBL1171837 US10464902, Ponatinib | US9255107, AP24534
TypeSmall organic molecule
Emp. Form.C29H27F3N6O
Mol. Mass.532.5595
SMILESCN1CCN(Cc2ccc(NC(=O)c3ccc(C)c(c3)C#Cc3cnc4cccnn34)cc2C(F)(F)F)CC1