Reaction Details
TargetSodium/glucose cotransporter 1
LigandBDBM176727
Substrate/Competitorn/a
Meas. Tech.ChEMBL_1654379 (CHEMBL4003745)
IC50 48±n/a nM
Citation Goodwin, NCDing, ZMHarrison, BAStrobel, EDHarris, ALSmith, MThompson, AYXiong, WMseeh, FBruce, DJDiaz, DGopinathan, SLi, LO'Neill, EThiel, MWilson, AGCarson, KGPowell, DRRawlins, DB Discovery of LX2761, a Sodium-Dependent Glucose Cotransporter 1 (SGLT1) Inhibitor Restricted to the Intestinal Lumen, for the Treatment of Diabetes. J Med Chem60:710-721 (2017) 
 
Sodium/glucose cotransporter 1
Name:Sodium/glucose cotransporter 1
Type:Protein
Mol. Mass.:73503.78
Organism:Homo sapiens (Human)
Description:P13866
Residue:664
BDBM176727
NameBDBM176727
Synonyms:US9688710, 149 1-(1-hydroxy-2-methylpropan-2-yl)-3-(2-(4-(2-methyl-5-((3R,4R,5S,6R)-3,4,5-trihydroxy-6-(methylthio)tetrahydro-2H-pyran-2-yl)benzyl)phenoxy)ethyl)urea
TypeSmall organic molecule
Emp. Form.C27H38N2O7S
Mol. Mass.534.665
SMILESCS[C@H]1O[C@H]([C@H](O)[C@@H](O)[C@@H]1O)c1ccc(C)c(Cc2ccc(OCCNC(=O)NC(C)(C)CO)cc2)c1