Reaction Details
TargetSodium/glucose cotransporter 2
LigandBDBM176438
Substrate/Competitorn/a
Meas. Tech.ChEMBL_1654380 (CHEMBL4003746)
IC50 5.2±n/a nM
Citation Goodwin, NCDing, ZMHarrison, BAStrobel, EDHarris, ALSmith, MThompson, AYXiong, WMseeh, FBruce, DJDiaz, DGopinathan, SLi, LO'Neill, EThiel, MWilson, AGCarson, KGPowell, DRRawlins, DB Discovery of LX2761, a Sodium-Dependent Glucose Cotransporter 1 (SGLT1) Inhibitor Restricted to the Intestinal Lumen, for the Treatment of Diabetes. J Med Chem60:710-721 (2017) 
 
Sodium/glucose cotransporter 2
Name:Sodium/glucose cotransporter 2
Type:Protein
Mol. Mass.:72902.00
Organism:Homo sapiens (Human)
Description:P31639
Residue:672
BDBM176438
NameBDBM176438
Synonyms:US9688710, 37 2-methyl-2-(2-(4-(2-methyl-5-((2S,3R,4R,5S,6R)-3,4,5-trihydroxy-6-(methylthio)tetrahydro-2H-pyran-2-yl)benzyl)phenoxy)acetamido)propanamide
TypeSmall organic molecule
Emp. Form.C26H34N2O7S
Mol. Mass.518.622
SMILESCS[C@H]1O[C@H]([C@H](O)[C@@H](O)[C@@H]1O)c1ccc(C)c(Cc2ccc(OCC(=O)NC(C)(C)C(N)=O)cc2)c1