Reaction Details
TargetSodium/glucose cotransporter 2
LigandBDBM176712
Substrate/Competitorn/a
Meas. Tech.ChEMBL_1654380 (CHEMBL4003746)
IC50 2.5±n/a nM
Citation Goodwin, NCDing, ZMHarrison, BAStrobel, EDHarris, ALSmith, MThompson, AYXiong, WMseeh, FBruce, DJDiaz, DGopinathan, SLi, LO'Neill, EThiel, MWilson, AGCarson, KGPowell, DRRawlins, DB Discovery of LX2761, a Sodium-Dependent Glucose Cotransporter 1 (SGLT1) Inhibitor Restricted to the Intestinal Lumen, for the Treatment of Diabetes. J Med Chem60:710-721 (2017) 
 
Sodium/glucose cotransporter 2
Name:Sodium/glucose cotransporter 2
Type:Protein
Mol. Mass.:72902.00
Organism:Homo sapiens (Human)
Description:P31639
Residue:672
BDBM176712
NameBDBM176712
Synonyms:US9688710, 135 (3R,4R,5S,6R)-2-(3-(4-(3-((1-hydroxy-2-methylpropan-2-yl)amino)propoxy)benzyl)-4-methylphenyl)-6-(methylthio)tetrahydro-2H-pyran-3,4,5-triol
TypeSmall organic molecule
Emp. Form.C27H39NO6S
Mol. Mass.505.667
SMILESCS[C@H]1O[C@H]([C@H](O)[C@@H](O)[C@@H]1O)c1ccc(C)c(Cc2ccc(OCCCNC(C)(C)CO)cc2)c1