Reaction Details
TargetSodium/glucose cotransporter 1
LigandBDBM176701
Substrate/Competitorn/a
Meas. Tech.ChEMBL_1654379 (CHEMBL4003745)
IC50 8.4±n/a nM
Citation Goodwin, NCDing, ZMHarrison, BAStrobel, EDHarris, ALSmith, MThompson, AYXiong, WMseeh, FBruce, DJDiaz, DGopinathan, SLi, LO'Neill, EThiel, MWilson, AGCarson, KGPowell, DRRawlins, DB Discovery of LX2761, a Sodium-Dependent Glucose Cotransporter 1 (SGLT1) Inhibitor Restricted to the Intestinal Lumen, for the Treatment of Diabetes. J Med Chem60:710-721 (2017) 
 
Sodium/glucose cotransporter 1
Name:Sodium/glucose cotransporter 1
Type:Protein
Mol. Mass.:73503.78
Organism:Homo sapiens (Human)
Description:P13866
Residue:664
BDBM176701
NameBDBM176701
Synonyms:US9688710, 124 4-(4-(2-methyl-5-((2S,3R,4R,5S,6R)-3,4,5-trihydroxy-6-(methylthio)tetrahydro-2H-pyran-2-yl)benzyl)phenyl)-N-(2-(4-methylpiperazin-1-yl)-2-oxoethyl)butanamide
TypeSmall organic molecule
Emp. Form.C31H43N3O6S
Mol. Mass.585.755
SMILESCS[C@H]1O[C@H]([C@H](O)[C@@H](O)[C@@H]1O)c1ccc(C)c(Cc2ccc(CCCC(=O)NCC(=O)N3CCN(C)CC3)cc2)c1