Reaction Details
TargetAdenosine receptor A2a
LigandBDBM50235047
Substrate/Competitorn/a
Meas. Tech.ChEMBL_1654441 (CHEMBL4003807)
Ki 2.1±n/a nM
Citation Basu, SBarawkar, DAThorat, SShejul, YDPatel, MNaykodi, MJain, VSalve, YPrasad, VChaudhary, SGhosh, IBhat, GQuraishi, APatil, HAnsari, SMenon, SUnadkat, VThakare, RSeervi, MSMeru, AVDe, SBhamidipati, RKRouduri, SRPalle, VPChug, AMookhtiar, KA Design, Synthesis of Novel, Potent, Selective, Orally Bioavailable Adenosine A J Med Chem60:681-694 (2017) 
 
Adenosine receptor A2a
Name:Adenosine receptor A2a
Type:G Protein-Coupled Receptor (GPCR)
Mol. Mass.:44716.46
Organism:Homo sapiens (Human)
Description:P29274
Residue:412
BDBM50235047
NameBDBM50235047
Synonyms:CHEMBL4102234
TypeSmall organic molecule
Emp. Form.C23H25N3O6S
Mol. Mass.471.526
SMILESCOc1ccc(N2CCOCC2)c2sc(NC(=O)C(C)(C)Oc3ccc4OCOc4c3)nc12