Reaction Details
TargetAdenosine receptor A2a
LigandBDBM50235056
Substrate/Competitorn/a
Meas. Tech.ChEMBL_1654437 (CHEMBL4003803)
Ki 5.4±n/a nM
Citation Basu, SBarawkar, DAThorat, SShejul, YDPatel, MNaykodi, MJain, VSalve, YPrasad, VChaudhary, SGhosh, IBhat, GQuraishi, APatil, HAnsari, SMenon, SUnadkat, VThakare, RSeervi, MSMeru, AVDe, SBhamidipati, RKRouduri, SRPalle, VPChug, AMookhtiar, KA Design, Synthesis of Novel, Potent, Selective, Orally Bioavailable Adenosine A J Med Chem60:681-694 (2017) 
 
Adenosine receptor A2a
Name:Adenosine receptor A2a
Type:G Protein-Coupled Receptor (GPCR)
Mol. Mass.:44716.46
Organism:Homo sapiens (Human)
Description:P29274
Residue:412
BDBM50235056
NameBDBM50235056
Synonyms:CHEMBL4078896
TypeSmall organic molecule
Emp. Form.C23H27N3O4S
Mol. Mass.441.543
SMILESCOc1ccc(N2CCOCC2)c2sc(NC(=O)C(C)(C)Oc3ccc(C)cc3)nc12