Reaction Details
TargetAdenosine receptor A2a
LigandBDBM50235057
Substrate/Competitorn/a
Meas. Tech.ChEMBL_1654441 (CHEMBL4003807)
Ki 1.8±n/a nM
Citation Basu, SBarawkar, DAThorat, SShejul, YDPatel, MNaykodi, MJain, VSalve, YPrasad, VChaudhary, SGhosh, IBhat, GQuraishi, APatil, HAnsari, SMenon, SUnadkat, VThakare, RSeervi, MSMeru, AVDe, SBhamidipati, RKRouduri, SRPalle, VPChug, AMookhtiar, KA Design, Synthesis of Novel, Potent, Selective, Orally Bioavailable Adenosine A J Med Chem60:681-694 (2017) 
 
Adenosine receptor A2a
Name:Adenosine receptor A2a
Type:G Protein-Coupled Receptor (GPCR)
Mol. Mass.:44716.46
Organism:Homo sapiens (Human)
Description:P29274
Residue:412
BDBM50235057
NameBDBM50235057
Synonyms:CHEMBL4094491
TypeSmall organic molecule
Emp. Form.C24H29N3O6S
Mol. Mass.487.569
SMILESCOc1ccc(OC(C)(C)C(=O)Nc2nc3c(OC)ccc(N4CCOCC4)c3s2)cc1OC