Reaction Details
TargetATP-sensitive inward rectifier potassium channel 1
LigandBDBM50235201
Substrate/Competitorn/a
Meas. Tech.ChEMBL_1654945 (CHEMBL4004311)
IC50 10.0±n/a nM
Citation Chobanian, HRGuo, YPio, BTang, HTeumelsan, NClements, MFrie, JFerguson, RGuo, ZThomas-Fowlkes, BSFelix, JPLiu, JKohler, MPriest, BHampton, CPai, LYCorona, AMetzger, JTong, VJoshi, EMXu, LOwens, KMaloney, KSullivan, KPasternak, A The design and synthesis of novel spirocyclic heterocyclic sulfone ROMK inhibitors as diuretics. Bioorg Med Chem Lett27:1109-1114 (2017) 
 
ATP-sensitive inward rectifier potassium channel 1
Name:ATP-sensitive inward rectifier potassium channel 1
Type:Enzyme Catalytic Domain
Mol. Mass.:44809.08
Organism:Homo sapiens (Human)
Description:gi_223460826
Residue:391
BDBM50235201
NameBDBM50235201
Synonyms:CHEMBL4066423
TypeSmall organic molecule
Emp. Form.C25H28N4O3
Mol. Mass.432.5148
SMILESCc1c2COC(=O)c2ccc1[C@@H](O)CN1CCC2(CCN(C2)c2cncc(c2)C#N)CC1